tests: acme_dns_tiny: fix tearDown clean configuration files

11 jobs for !21 with improve-gitlab-ci in 10 minutes and 14 seconds (queued for 3 seconds)
detached
Status Job ID Name Coverage
  Build
passed #646
buster-slim

00:00:48

passed #644
jessie-slim

00:00:41

passed #645
stretch-slim

00:00:40

 
  Check
passed #647
compile

00:00:49

passed #648
lint

00:01:11

 
  Unit Test
passed #651
buster-ut

00:00:56

passed #649
jessie-ut

00:00:45

passed #650
stretch-ut

00:00:50

 
  Lets Encrypt Staging
failed #654
buster-le-staging

00:01:08

failed #652
jessie-le-staging

00:01:10

failed #653
stretch-le-staging

00:01:10

 
Name Stage Failure
failed
jessie-le-staging Lets Encrypt Staging
AssertionError: 3 != 1

----------------------------------------------------------------------
Ran 12 tests in 28.066s

FAILED (failures=2, errors=13)
Running after_script
Uploading artifacts for failed job
ERROR: Job failed: exit code 1
failed
stretch-le-staging Lets Encrypt Staging
AssertionError: 3 != 1

----------------------------------------------------------------------
Ran 12 tests in 29.596s

FAILED (failures=2, errors=13)
Running after_script
Uploading artifacts for failed job
ERROR: Job failed: exit code 1
failed
buster-le-staging Lets Encrypt Staging
Running after script...
$ python3-coverage report --include=acme_dns_tiny.py --include=tools/acme_account_rollover.py --include=tools/acme_account_deactivate.py
Name Stmts Miss Cover
------------------------------------------------------
tools/acme_account_deactivate.py 72 44 39%
$ python3-coverage html
Couldn't find static file 'jquery.min.js' from '/builds/adrien/acme-dns-tiny', tried: ['/usr/share/javascript/jquery.min.js', '/usr/share/javascript/jquery/jquery.min.js', '/usr/lib/python3/dist-packages/coverage/htmlfiles/jquery.min.js', '/usr/lib/python3/dist-packages/coverage/htmlfiles/jquery/jquery.min.js']
Uploading artifacts for failed job
ERROR: Job failed: exit code 1