key rollover has been completely updated (acme has changed way to rollover and...

key rollover has been completely updated (acme has changed way to rollover and we needed to clarify better the code variable names)
3 jobs for v2.1-acme-draft-16 in 6 minutes and 49 seconds (queued for 17 seconds)
Status Job ID Name Coverage
  Test
failed #446
jessie

00:02:37

failed #447
jessie_backport

00:02:01

failed #448
stretch

00:02:10

 
Name Stage Failure
failed
stretch Test There is an unknown failure, please try again
  File "/builds/adrien/acme-dns-tiny/tests/test_acme_dns_tiny.py", line 45, in assertCertificateChain
self.assertEqual(3, len(certlist))
AssertionError: 3 != 1

----------------------------------------------------------------------
Ran 14 tests in 80.534s

FAILED (failures=3, errors=5)
ERROR: Job failed: exit code 1
failed
jessie_backport Test There is an unknown failure, please try again
  File "/builds/adrien/acme-dns-tiny/tests/test_acme_dns_tiny.py", line 45, in assertCertificateChain
self.assertEqual(3, len(certlist))
AssertionError: 3 != 1

----------------------------------------------------------------------
Ran 14 tests in 78.140s

FAILED (failures=3, errors=5)
ERROR: Job failed: exit code 1
failed
jessie Test There is an unknown failure, please try again
  File "/builds/adrien/acme-dns-tiny/tests/test_acme_dns_tiny.py", line 45, in assertCertificateChain
self.assertEqual(3, len(certlist))
AssertionError: 3 != 1

----------------------------------------------------------------------
Ran 14 tests in 81.220s

FAILED (failures=3, errors=5)
ERROR: Job failed: exit code 1